{"text_format":"1","workbook":"xlsx","n_sheets":6,"sheets":["Simulador","Data","Fechas","Hoja3","Hoja2","Hoja1"],"not_rendered":{"charts":0,"images":0,"macros":1,"external_links":0,"defined_names":1,"comments":0,"pivot_tables":0},"unopened":[],"bounds":{"document_bytes":16777216,"sheet_cells":100000,"rows_first":2000,"rows_last":500,"rows_between":2000,"halvings":0,"cell_chars":16384,"cell_head_chars":4096},"cells_cut":0,"cells_raw":0,"read":"whole","date_system":"1900"}

{"sheet":"Simulador","index":0,"n_rows":379,"n_cols":37,"rows_kept":379,"cut":false,"hidden":false,"merged":[[0,0,1,33],[14,0,14,33],[374,4,374,5],[375,4,375,5],[376,4,376,5],[16,2,17,2],[372,4,372,5],[373,4,373,5],[362,4,362,5],[341,4,341,5],[342,4,342,5],[343,4,343,5],[344,4,344,5],[345,4,345,5],[346,4,346,5],[347,4,347,5],[348,4,348,5],[349,4,349,5],[350,4,350,5],[351,4,351,5],[352,4,352,5],[353,4,353,5],[354,4,354,5],[355,4,355,5],[363,4,363,5],[356,4,356,5],[357,4,357,5],[358,4,358,5],[359,4,359,5],[360,4,360,5],[361,4,361,5],[377,4,377,5],[364,4,364,5],[365,4,365,5],[366,4,366,5],[367,4,367,5],[300,4,300,5],[301,4,301,5],[302,4,302,5],[303,4,303,5],[304,4,304,5],[305,4,305,5],[306,4,306,5],[307,4,307,5],[242,4,242,5],[243,4,243,5],[244,4,244,5],[245,4,245,5],[246,4,246,5],[247,4,247,5],[248,4,248,5],[249,4,249,5],[250,4,250,5],[251,4,251,5],[252,4,252,5],[253,4,253,5],[254,4,254,5],[255,4,255,5],[256,4,256,5],[257,4,257,5],[258,4,258,5],[259,4,259,5],[260,4,260,5],[261,4,261,5],[378,4,378,5],[368,4,368,5],[369,4,369,5],[370,4,370,5],[371,4,371,5],[11,30,11,33],[308,4,308,5],[309,4,309,5],[310,4,310,5],[311,4,311,5],[312,4,312,5],[313,4,313,5],[314,4,314,5],[315,4,315,5],[316,4,316,5],[317,4,317,5],[318,4,318,5],[319,4,319,5],[320,4,320,5],[321,4,321,5],[322,4,322,5],[323,4,323,5],[324,4,324,5],[325,4,325,5],[326,4,326,5],[327,4,327,5],[328,4,328,5],[329,4,329,5],[330,4,330,5],[331,4,331,5],[332,4,332,5],[333,4,333,5],[334,4,334,5],[335,4,335,5],[336,4,336,5],[337,4,337,5],[338,4,338,5],[339,4,339,5],[340,4,340,5],[275,4,275,5],[276,4,276,5],[277,4,277,5],[278,4,278,5],[279,4,279,5],[280,4,280,5],[281,4,281,5],[282,4,282,5],[283,4,283,5],[284,4,284,5],[285,4,285,5],[286,4,286,5],[287,4,287,5],[288,4,288,5],[289,4,289,5],[290,4,290,5],[291,4,291,5],[292,4,292,5],[293,4,293,5],[294,4,294,5],[295,4,295,5],[296,4,296,5],[297,4,297,5],[298,4,298,5],[299,4,299,5],[262,4,262,5],[263,4,263,5],[264,4,264,5],[265,4,265,5],[266,4,266,5],[267,4,267,5],[268,4,268,5],[269,4,269,5],[270,4,270,5],[271,4,271,5],[272,4,272,5],[273,4,273,5],[274,4,274,5],[209,4,209,5],[210,4,210,5],[211,4,211,5],[212,4,212,5],[213,4,213,5],[214,4,214,5],[215,4,215,5],[216,4,216,5],[217,4,217,5],[218,4,218,5],[219,4,219,5],[220,4,220,5],[221,4,221,5],[222,4,222,5],[223,4,223,5],[224,4,224,5],[225,4,225,5],[226,4,226,5],[227,4,227,5],[228,4,228,5],[229,4,229,5],[230,4,230,5],[231,4,231,5],[232,4,232,5],[233,4,233,5],[234,4,234,5],[235,4,235,5],[236,4,236,5],[237,4,237,5],[238,4,238,5],[239,4,239,5],[240,4,240,5],[241,4,241,5],[176,4,176,5],[177,4,177,5],[178,4,178,5],[179,4,179,5],[180,4,180,5],[181,4,181,5],[182,4,182,5],[183,4,183,5],[184,4,184,5],[185,4,185,5],[186,4,186,5],[187,4,187,5],[188,4,188,5],[189,4,189,5],[190,4,190,5],[191,4,191,5],[192,4,192,5],[193,4,193,5],[194,4,194,5],[195,4,195,5],[196,4,196,5],[197,4,197,5],[198,4,198,5],[199,4,199,5],[200,4,200,5],[201,4,201,5],[202,4,202,5],[203,4,203,5],[204,4,204,5],[205,4,205,5],[206,4,206,5],[207,4,207,5],[208,4,208,5],[143,4,143,5],[144,4,144,5],[145,4,145,5],[146,4,146,5],[147,4,147,5],[148,4,148,5],[149,4,149,5],[150,4,150,5],[151,4,151,5],[152,4,152,5],[153,4,153,5],[154,4,154,5],[155,4,155,5],[156,4,156,5],[157,4,157,5],[158,4,158,5],[159,4,159,5],[160,4,160,5],[161,4,161,5],[162,4,162,5],[163,4,163,5],[164,4,164,5],[165,4,165,5],[166,4,166,5],[167,4,167,5],[168,4,168,5],[169,4,169,5],[170,4,170,5],[171,4,171,5],[172,4,172,5],[173,4,173,5],[174,4,174,5],[175,4,175,5],[65533,8,65533,10],[65522,8,65522,10],[65523,8,65523,10],[65524,8,65524,10],[65525,8,65525,10],[65526,8,65526,10],[65527,8,65527,10],[65534,8,65534,10],[65535,8,65535,10],[19,36,19,37],[20,36,20,37],[21,36,21,37],[22,36,22,37],[23,36,23,37],[65528,8,65528,10],[65529,8,65529,10],[56,4,56,5],[57,4,57,5],[58,4,58,5],[59,4,59,5],[60,4,60,5],[61,4,61,5],[62,4,62,5],[63,4,63,5],[64,4,64,5],[65,4,65,5],[66,4,66,5],[67,4,67,5],[68,4,68,5],[69,4,69,5],[70,4,70,5],[71,4,71,5],[72,4,72,5],[73,4,73,5],[74,4,74,5],[75,4,75,5],[76,4,76,5],[77,4,77,5],[78,4,78,5],[79,4,79,5],[80,4,80,5],[81,4,81,5],[82,4,82,5],[83,4,83,5],[84,4,84,5],[85,4,85,5],[86,4,86,5],[87,4,87,5],[88,4,88,5],[89,4,89,5],[90,4,90,5],[91,4,91,5],[92,4,92,5],[93,4,93,5],[94,4,94,5],[95,4,95,5],[96,4,96,5],[97,4,97,5],[98,4,98,5],[99,4,99,5],[100,4,100,5],[101,4,101,5],[102,4,102,5],[65492,8,65492,10],[65493,8,65493,10],[65494,8,65494,10],[65495,8,65495,10],[65496,8,65496,10],[65497,8,65497,10],[65498,8,65498,10],[65499,8,65499,10],[65500,8,65500,10],[65501,8,65501,10],[65502,8,65502,10],[65503,8,65503,10],[65504,8,65504,10],[65505,8,65505,10],[65506,8,65506,10],[65507,8,65507,10],[65508,8,65508,10],[65509,8,65509,10],[65510,8,65510,10],[65511,8,65511,10],[65512,8,65512,10],[65513,8,65513,10],[65514,8,65514,10],[65515,8,65515,10],[65516,8,65516,10],[65517,8,65517,10],[65518,8,65518,10],[65519,8,65519,10],[65520,8,65520,10],[65521,8,65521,10],[65530,8,65530,10],[65531,8,65531,10],[65532,8,65532,10],[65459,8,65459,10],[65460,8,65460,10],[65461,8,65461,10],[65462,8,65462,10],[65463,8,65463,10],[65464,8,65464,10],[65465,8,65465,10],[65466,8,65466,10],[65467,8,65467,10],[65468,8,65468,10],[65469,8,65469,10],[65470,8,65470,10],[65471,8,65471,10],[65472,8,65472,10],[65473,8,65473,10],[65474,8,65474,10],[65475,8,65475,10],[65476,8,65476,10],[65477,8,65477,10],[65478,8,65478,10],[65479,8,65479,10],[65480,8,65480,10],[65481,8,65481,10],[65482,8,65482,10],[65483,8,65483,10],[65484,8,65484,10],[65485,8,65485,10],[65486,8,65486,10],[65487,8,65487,10],[65488,8,65488,10],[65489,8,65489,10],[65490,8,65490,10],[65491,8,65491,10],[65426,8,65426,10],[65427,8,65427,10],[65428,8,65428,10],[65429,8,65429,10],[65430,8,65430,10],[65431,8,65431,10],[65432,8,65432,10],[65433,8,65433,10],[65434,8,65434,10],[65435,8,65435,10],[65436,8,65436,10],[65437,8,65437,10],[65438,8,65438,10],[65439,8,65439,10],[65440,8,65440,10],[65441,8,65441,10],[65442,8,65442,10],[65443,8,65443,10],[65444,8,65444,10],[65445,8,65445,10],[65446,8,65446,10],[65447,8,65447,10],[65448,8,65448,10],[65449,8,65449,10],[65450,8,65450,10],[65451,8,65451,10],[65452,8,65452,10],[65453,8,65453,10],[65454,8,65454,10],[65455,8,65455,10],[65456,8,65456,10],[65457,8,65457,10],[65458,8,65458,10],[65393,8,65393,10],[65394,8,65394,10],[65395,8,65395,10],[65396,8,65396,10],[65397,8,65397,10],[65398,8,65398,10],[65399,8,65399,10],[65400,8,65400,10],[65401,8,65401,10],[65402,8,65402,10],[65403,8,65403,10],[65404,8,65404,10],[65405,8,65405,10],[65406,8,65406,10],[65407,8,65407,10],[65408,8,65408,10],[65409,8,65409,10],[65410,8,65410,10],[65411,8,65411,10],[65412,8,65412,10],[65413,8,65413,10],[65414,8,65414,10],[65415,8,65415,10],[65416,8,65416,10],[65417,8,65417,10],[65418,8,65418,10],[65419,8,65419,10],[65420,8,65420,10],[65421,8,65421,10],[65422,8,65422,10],[65423,8,65423,10],[65424,8,65424,10],[65425,8,65425,10],[65360,8,65360,10],[65361,8,65361,10],[65362,8,65362,10],[65363,8,65363,10],[65364,8,65364,10],[65365,8,65365,10],[65366,8,65366,10],[65367,8,65367,10],[65368,8,65368,10],[65369,8,65369,10],[65370,8,65370,10],[65371,8,65371,10],[65372,8,65372,10],[65373,8,65373,10],[65374,8,65374,10],[65375,8,65375,10],[65376,8,65376,10],[65377,8,65377,10],[65378,8,65378,10],[65379,8,65379,10],[65380,8,65380,10],[65381,8,65381,10],[65382,8,65382,10],[65383,8,65383,10],[65384,8,65384,10],[65385,8,65385,10],[65386,8,65386,10],[65387,8,65387,10],[65388,8,65388,10],[65389,8,65389,10],[65390,8,65390,10],[65391,8,65391,10],[65392,8,65392,10],[65327,8,65327,10],[65328,8,65328,10],[65329,8,65329,10],[65330,8,65330,10],[65331,8,65331,10],[65332,8,65332,10],[65333,8,65333,10],[65334,8,65334,10],[65335,8,65335,10],[65336,8,65336,10],[65337,8,65337,10],[65338,8,65338,10],[65339,8,65339,10],[65340,8,65340,10],[65341,8,65341,10],[65342,8,65342,10],[65343,8,65343,10],[65344,8,65344,10],[65345,8,65345,10],[65346,8,65346,10],[65347,8,65347,10],[65348,8,65348,10],[65349,8,65349,10],[65350,8,65350,10],[65351,8,65351,10],[65352,8,65352,10],[65353,8,65353,10],[65354,8,65354,10],[65355,8,65355,10],[65356,8,65356,10],[65357,8,65357,10],[65358,8,65358,10],[65359,8,65359,10],[65294,8,65294,10],[65295,8,65295,10],[65296,8,65296,10],[65297,8,65297,10],[65298,8,65298,10],[65299,8,65299,10],[65300,8,65300,10],[65301,8,65301,10],[65302,8,65302,10],[65303,8,65303,10],[65304,8,65304,10],[65305,8,65305,10],[65306,8,65306,10],[65307,8,65307,10],[65308,8,65308,10],[65309,8,65309,10],[65310,8,65310,10],[65311,8,65311,10],[65312,8,65312,10],[65313,8,65313,10],[65314,8,65314,10],[65315,8,65315,10],[65316,8,65316,10],[65317,8,65317,10],[65318,8,65318,10],[65319,8,65319,10],[65320,8,65320,10],[65321,8,65321,10],[65322,8,65322,10],[65323,8,65323,10],[65324,8,65324,10],[65325,8,65325,10],[65326,8,65326,10],[65261,8,65261,10],[65262,8,65262,10],[65263,8,65263,10],[65264,8,65264,10],[65265,8,65265,10],[65266,8,65266,10],[65267,8,65267,10],[65268,8,65268,10],[65269,8,65269,10],[65270,8,65270,10],[65271,8,65271,10],[65272,8,65272,10],[65273,8,65273,10],[65274,8,65274,10],[65275,8,65275,10],[65276,8,65276,10],[65277,8,65277,10],[65278,8,65278,10],[65279,8,65279,10],[65280,8,65280,10],[65281,8,65281,10],[65282,8,65282,10],[65283,8,65283,10],[65284,8,65284,10],[65285,8,65285,10],[65286,8,65286,10],[65287,8,65287,10],[65288,8,65288,10],[65289,8,65289,10],[65290,8,65290,10],[65291,8,65291,10],[65292,8,65292,10],[65293,8,65293,10],[65228,8,65228,10],[65229,8,65229,10],[65230,8,65230,10],[65231,8,65231,10],[65232,8,65232,10],[65233,8,65233,10],[65234,8,65234,10],[65235,8,65235,10],[65236,8,65236,10],[65237,8,65237,10],[65238,8,65238,10],[65239,8,65239,10],[65240,8,65240,10],[65241,8,65241,10],[65242,8,65242,10],[65243,8,65243,10],[65244,8,65244,10],[65245,8,65245,10],[65246,8,65246,10],[65247,8,65247,10],[65248,8,65248,10],[65249,8,65249,10],[65250,8,65250,10],[65251,8,65251,10],[65252,8,65252,10],[65253,8,65253,10],[65254,8,65254,10],[65255,8,65255,10],[65256,8,65256,10],[65257,8,65257,10],[65258,8,65258,10],[65259,8,65259,10],[65260,8,65260,10],[65195,8,65195,10],[65196,8,65196,10],[65197,8,65197,10],[65198,8,65198,10],[65199,8,65199,10],[65200,8,65200,10],[65201,8,65201,10],[65202,8,65202,10],[65203,8,65203,10],[65204,8,65204,10],[65205,8,65205,10],[65206,8,65206,10],[65207,8,65207,10],[65208,8,65208,10],[65209,8,65209,10],[65210,8,65210,10],[65211,8,65211,10],[65212,8,65212,10],[65213,8,65213,10],[65214,8,65214,10],[65215,8,65215,10],[65216,8,65216,10],[65217,8,65217,10],[65218,8,65218,10],[65219,8,65219,10],[65220,8,65220,10],[65221,8,65221,10],[65222,8,65222,10],[65223,8,65223,10],[65224,8,65224,10],[65225,8,65225,10],[65226,8,65226,10],[65227,8,65227,10],[65162,8,65162,10],[65163,8,65163,10],[65164,8,65164,10],[65165,8,65165,10],[65166,8,65166,10],[65167,8,65167,10],[65168,8,65168,10],[65169,8,65169,10],[65170,8,65170,10],[65171,8,65171,10],[65172,8,65172,10],[65173,8,65173,10],[65174,8,65174,10],[65175,8,65175,10],[65176,8,65176,10],[65177,8,65177,10],[65178,8,65178,10],[65179,8,65179,10],[65180,8,65180,10],[65181,8,65181,10],[65182,8,65182,10],[65183,8,65183,10],[65184,8,65184,10],[65185,8,65185,10],[65186,8,65186,10],[65187,8,65187,10],[65188,8,65188,10],[65189,8,65189,10],[65190,8,65190,10],[65191,8,65191,10],[65192,8,65192,10],[65193,8,65193,10],[65194,8,65194,10],[65129,8,65129,10],[65130,8,65130,10],[65131,8,65131,10],[65132,8,65132,10],[65133,8,65133,10],[65134,8,65134,10],[65135,8,65135,10],[65136,8,65136,10],[65137,8,65137,10],[65138,8,65138,10],[65139,8,65139,10],[65140,8,65140,10],[65141,8,65141,10],[65142,8,65142,10],[65143,8,65143,10],[65144,8,65144,10],[65145,8,65145,10],[65146,8,65146,10],[65147,8,65147,10],[65148,8,65148,10],[65149,8,65149,10],[65150,8,65150,10],[65151,8,65151,10],[65152,8,65152,10],[65153,8,65153,10],[65154,8,65154,10],[65155,8,65155,10],[65156,8,65156,10],[65157,8,65157,10],[65158,8,65158,10],[65159,8,65159,10],[65160,8,65160,10],[65161,8,65161,10],[65096,8,65096,10],[65097,8,65097,10],[65098,8,65098,10],[65099,8,65099,10],[65100,8,65100,10],[65101,8,65101,10],[65102,8,65102,10],[65103,8,65103,10],[65104,8,65104,10],[65105,8,65105,10],[65106,8,65106,10],[65107,8,65107,10],[65108,8,65108,10],[65109,8,65109,10],[65110,8,65110,10],[65111,8,65111,10],[65112,8,65112,10],[65113,8,65113,10],[65114,8,65114,10],[65115,8,65115,10],[65116,8,65116,10],[65117,8,65117,10],[65118,8,65118,10],[65119,8,65119,10],[65120,8,65120,10],[65121,8,65121,10],[65122,8,65122,10],[65123,8,65123,10],[65124,8,65124,10],[65125,8,65125,10],[65126,8,65126,10],[65127,8,65127,10],[65128,8,65128,10],[65063,8,65063,10],[65064,8,65064,10],[65065,8,65065,10],[65066,8,65066,10],[65067,8,65067,10],[65068,8,65068,10],[65069,8,65069,10],[65070,8,65070,10],[65071,8,65071,10],[65072,8,65072,10],[65073,8,65073,10],[65074,8,65074,10],[65075,8,65075,10],[65076,8,65076,10],[65077,8,65077,10],[65078,8,65078,10],[65079,8,65079,10],[65080,8,65080,10],[65081,8,65081,10],[65082,8,65082,10],[65083,8,65083,10],[65084,8,65084,10],[65085,8,65085,10],[65086,8,65086,10],[65087,8,65087,10],[65088,8,65088,10],[65089,8,65089,10],[65090,8,65090,10],[65091,8,65091,10],[65092,8,65092,10],[65093,8,65093,10],[65094,8,65094,10],[65095,8,65095,10],[65030,8,65030,10],[65031,8,65031,10],[65032,8,65032,10],[65033,8,65033,10],[65034,8,65034,10],[65035,8,65035,10],[65036,8,65036,10],[65037,8,65037,10],[65038,8,65038,10],[65039,8,65039,10],[65040,8,65040,10],[65041,8,65041,10],[65042,8,65042,10],[65043,8,65043,10],[65044,8,65044,10],[65045,8,65045,10],[65046,8,65046,10],[65047,8,65047,10],[65048,8,65048,10],[65049,8,65049,10],[65050,8,65050,10],[65051,8,65051,10],[65052,8,65052,10],[65053,8,65053,10],[65054,8,65054,10],[65055,8,65055,10],[65056,8,65056,10],[65057,8,65057,10],[65058,8,65058,10],[65059,8,65059,10],[65060,8,65060,10],[65061,8,65061,10],[65062,8,65062,10],[64997,8,64997,10],[64998,8,64998,10],[64999,8,64999,10],[65000,8,65000,10],[65001,8,65001,10],[65002,8,65002,10],[65003,8,65003,10],[65004,8,65004,10],[65005,8,65005,10],[65006,8,65006,10],[65007,8,65007,10],[65008,8,65008,10],[65009,8,65009,10],[65010,8,65010,10],[65011,8,65011,10],[65012,8,65012,10],[65013,8,65013,10],[65014,8,65014,10],[65015,8,65015,10],[65016,8,65016,10],[65017,8,65017,10],[65018,8,65018,10],[65019,8,65019,10],[65020,8,65020,10],[65021,8,65021,10],[65022,8,65022,10],[65023,8,65023,10],[65024,8,65024,10],[65025,8,65025,10],[65026,8,65026,10],[65027,8,65027,10],[65028,8,65028,10],[65029,8,65029,10],[64964,8,64964,10],[64965,8,64965,10],[64966,8,64966,10],[64967,8,64967,10],[64968,8,64968,10],[64969,8,64969,10],[64970,8,64970,10],[64971,8,64971,10],[64972,8,64972,10],[64973,8,64973,10],[64974,8,64974,10],[64975,8,64975,10],[64976,8,64976,10],[64977,8,64977,10],[64978,8,64978,10],[64979,8,64979,10],[64980,8,64980,10],[64981,8,64981,10],[64982,8,64982,10],[64983,8,64983,10],[64984,8,64984,10],[64985,8,64985,10],[64986,8,64986,10],[64987,8,64987,10],[64988,8,64988,10],[64989,8,64989,10],[64990,8,64990,10],[64991,8,64991,10],[64992,8,64992,10],[64993,8,64993,10],[64994,8,64994,10],[64995,8,64995,10],[64996,8,64996,10],[64931,8,64931,10],[64932,8,64932,10],[64933,8,64933,10],[64934,8,64934,10],[64935,8,64935,10],[64936,8,64936,10],[64937,8,64937,10],[64938,8,64938,10],[64939,8,64939,10],[64940,8,64940,10],[64941,8,64941,10],[64942,8,64942,10],[64943,8,64943,10],[64944,8,64944,10],[64945,8,64945,10],[64946,8,64946,10],[64947,8,64947,10],[64948,8,64948,10],[64949,8,64949,10],[64950,8,64950,10],[64951,8,64951,10],[64952,8,64952,10],[64953,8,64953,10],[64954,8,64954,10],[64955,8,64955,10],[64956,8,64956,10],[64957,8,64957,10],[64958,8,64958,10],[64959,8,64959,10],[64960,8,64960,10],[64961,8,64961,10],[64962,8,64962,10],[64963,8,64963,10],[64898,8,64898,10],[64899,8,64899,10],[64900,8,64900,10],[64901,8,64901,10],[64902,8,64902,10],[64903,8,64903,10],[64904,8,64904,10],[64905,8,64905,10],[64906,8,64906,10],[64907,8,64907,10],[64908,8,64908,10],[64909,8,64909,10],[64910,8,64910,10],[64911,8,64911,10],[64912,8,64912,10],[64913,8,64913,10],[64914,8,64914,10],[64915,8,64915,10],[64916,8,64916,10],[64917,8,64917,10],[64918,8,64918,10],[64919,8,64919,10],[64920,8,64920,10],[64921,8,64921,10],[64922,8,64922,10],[64923,8,64923,10],[64924,8,64924,10],[64925,8,64925,10],[64926,8,64926,10],[64927,8,64927,10],[64928,8,64928,10],[64929,8,64929,10],[64930,8,64930,10],[64865,8,64865,10],[64866,8,64866,10],[64867,8,64867,10],[64868,8,64868,10],[64869,8,64869,10],[64870,8,64870,10],[64871,8,64871,10],[64872,8,64872,10],[64873,8,64873,10],[64874,8,64874,10],[64875,8,64875,10],[64876,8,64876,10],[64877,8,64877,10],[64878,8,64878,10],[64879,8,64879,10],[64880,8,64880,10],[64881,8,64881,10],[64882,8,64882,10],[64883,8,64883,10],[64884,8,64884,10],[64885,8,64885,10],[64886,8,64886,10],[64887,8,64887,10],[64888,8,64888,10],[64889,8,64889,10],[64890,8,64890,10],[64891,8,64891,10],[64892,8,64892,10],[64893,8,64893,10],[64894,8,64894,10],[64895,8,64895,10],[64896,8,64896,10],[64897,8,64897,10],[64832,8,64832,10],[64833,8,64833,10],[64834,8,64834,10],[64835,8,64835,10],[64836,8,64836,10],[64837,8,64837,10],[64838,8,64838,10],[64839,8,64839,10],[64840,8,64840,10],[64841,8,64841,10],[64842,8,64842,10],[64843,8,64843,10],[64844,8,64844,10],[64845,8,64845,10],[64846,8,64846,10],[64847,8,64847,10],[64848,8,64848,10],[64849,8,64849,10],[64850,8,64850,10],[64851,8,64851,10],[64852,8,64852,10],[64853,8,64853,10],[64854,8,64854,10],[64855,8,64855,10],[64856,8,64856,10],[64857,8,64857,10],[64858,8,64858,10],[64859,8,64859,10],[64860,8,64860,10],[64861,8,64861,10],[64862,8,64862,10],[64863,8,64863,10],[64864,8,64864,10],[64799,8,64799,10],[64800,8,64800,10],[64801,8,64801,10],[64802,8,64802,10]],"merged_total":68820,"flags":["merged_cut"]}
["SIMULADOR DE CREDITOS"]
[]
[]
[null,null,null,null,null,null,null,null,null,null,null,null,null,null,null,null,null,null,null,null,null,null,null,null,null,null,null,null,null,null,null,null,{"$f":"SUM(AC20:AE379)","v":0.27622155874632348},{"$f":"MIN(H19:J379)","v":1.8189894035458565E-12},null,null,{"$f":"SUM(AC20:AE379)","v":0.27622155874632348}]
[null,"TEA FIJA",0.13500000000000001,null,null,null,null,null,null,2,null,null,null,null,null,null,null,null,null,null,18,null,null,null,5000,null,null,null,null,null,"SOLES",null,null,306.91284305147047]
[]
[]
[null,"Seguros e Impuestos",null,null,null,null,null,null,"Detalles del Financiamiento",null,null,null,null,null,null,null,null,null,null,null,null,null,null,null,null,null,null,null,null,null,null,null,null,{"$f":"Q20+T20+W20","v":53.04298623293402}]
[null,"Seguro desgravamen",null,null,0,null,null,null,"Tasa Efectiva Anual (TEA)",null,null,null,null,{"$f":"+C5","v":0.13500000000000001},null,"2018-12-09",null,null,null,null,0,null,null,null,null,30,"   Días despues          del Desembolso",null,null,null,null,null,null,{"$f":"Y5*AH10","v":53.04298623293402}]
[null,"Seg. Garantía y Otros",null,null,null,null,null,null,{"$f":"CONCATENATE(\"Tasa Efectiva \",VLOOKUP(Data!B3,Forma_de_pago,2,0),VLOOKUP(Data!B3,Forma_de_pago,9,0))","v":"Tasa Efectiva Mensual(TEM)"},null,null,null,null,{"$f":"POWER(1+C5,1/VLOOKUP(Data!B3,Forma_de_pago,4,FALSE))-1","v":1.0608597246586804E-2},null,null,null,null,null,null,null,null,null,null,null,null,null,null,null,null,null,null,null,1.0608597246586804E-2]
{"$rows_left_out":370}
{"sheet":"Data","index":1,"n_rows":43,"n_cols":10,"rows_kept":43,"cut":false,"hidden":true,"merged":[[4,1,4,2],[4,4,4,5]]}
[2,"FF/FC"]
[]
[null,3,"FREC",{"$f":"VLOOKUP(B3,$B$6:$G$15,6,FALSE)","v":6},{"$f":"VLOOKUP(B3,$B$6:$G$15,3,FALSE)","v":30}]
[]
[null,"Formas de Pago",null,"Dias","Per x año"]
[null,1,"Diario",1,360,"dias"]
[null,2,"Semanal",7,51,"semanas",2,{"$f":"1/4","v":0.25},"SEMANAL","(TES)"]
[null,3,"Mensual",30,12,"meses",6,1,"MENSUAL","(TEM)"]
[null,4,"Bimestral",60,6,"bimestres",10,2,"BIMENSUAL","(TEB)"]
[null,5,"Trimestral",90,4,"trimestres",12,3,"TRIMESTRAL","(TET)"]
{"$rows_left_out":34}
{"sheet":"Fechas","index":2,"n_rows":198,"n_cols":21,"rows_kept":198,"cut":false,"hidden":true,"merged":[[0,13,0,14],[0,15,0,16],[0,17,0,18],[0,19,0,20],[0,1,0,2],[0,3,0,4],[0,5,0,6],[0,7,0,8],[0,9,0,10],[0,11,0,12]]}
[null,"SEMANAL",null,"QUINCENAL",null,"MENSUAL",null,"MES Y MEDIO",null,"BIMENSUAL",null,"TRIMESTRAL",null,"CUATRIMESTRAL",null,"QUINTUMESTRAL",null,"SEMESTRAL",null,"ANUAL"]
[null,null,"dias desp desembolso",null,"dias desp desembolso",null,"dias desp desembolso",null,"dias desp desembolso",null,"dias desp desembolso",null,"dias desp desembolso",null,"dias desp desembolso",null,"dias desp desembolso",null,"dias desp desembolso",null,"dias desp desembolso"]
[null,null,{"$f":"VLOOKUP(Data!B3,Forma_de_pago,3,FALSE)*Simulador!U9+Simulador!Z9","v":30},null,{"$f":"C3","v":30},null,{"$f":"E3","v":30},null,{"$f":"G3","v":30},null,{"$f":"I3","v":30},null,{"$f":"K3","v":30},null,{"$f":"M3","v":30},null,{"$f":"O3","v":30},null,{"$f":"Q3","v":30},null,{"$f":"S3","v":30}]
[null,"base de calculo",30]
[null,"desembolso",{"$f":"Simulador!P9","v":"2018-12-09"},"desembolso",{"$f":"$C$5","v":"2018-12-09"},"desembolso",{"$f":"$C$5","v":"2018-12-09"},"desembolso",{"$f":"$C$5","v":"2018-12-09"},"desembolso",{"$f":"$C$5","v":"2018-12-09"},"desembolso","2018-12-09","desembolso","2018-12-09","desembolso","2018-12-09","desembolso","2018-12-09","desembolso","2018-12-09"]
[null,"a",7,"b",15,"c",30,null,45,null,60,null,90,null,120,null,150,null,180,null,360]
[1,1,{"$f":"C5+C3","v":"2019-01-08"},1,{"$f":"E5+E3","v":"2019-01-08"},1,{"$f":"G5+G3","v":"2019-01-08"},1,{"$f":"I5+I3","v":"2019-01-08"},1,{"$f":"K5+K3","v":"2019-01-08"},1,{"$f":"M5+M3","v":"2019-01-08"},1,{"$f":"O5+O3","v":"2019-01-08"},1,{"$f":"Q5+Q3","v":"2019-01-08"},1,{"$f":"S5+S3","v":"2019-01-08"},1,{"$f":"U5+U3","v":"2019-01-08"}]
[2,null,{"$f":"C7+7","v":"2019-01-15"},null,{"$f":"E7+$C$4/2","v":"2019-01-23"},2,{"$f":"EDATE(G7,1)","v":"2019-02-08"},null,{"$f":"I7+$C$4*1.5","v":"2019-02-22"},3,{"$f":"EDATE(K7,2)","v":"2019-03-08"},{"$f":"L7+3","v":4},{"$f":"EDATE(M7,3)","v":"2019-04-08"},{"$f":"N7+4","v":5},{"$f":"EDATE(O7,4)","v":"2019-05-08"},{"$f":"P7+5","v":6},{"$f":"EDATE(Q7,5)","v":"2019-06-08"},{"$f":"R7+6","v":7},{"$f":"EDATE(S7,6)","v":"2019-07-08"},{"$f":"T7+12","v":13},{"$f":"EDATE(U7,12)","v":"2020-01-08"}]
[3,null,{"$f":"C8+8","v":"2019-01-23"},2,{"$f":"EDATE(E7,1)","v":"2019-02-08"},3,{"$f":"IF(EDATE(G8,1)>EDATE(G7,2),EDATE(G8,1),EDATE(G7,2))","v":"2019-03-08"},{"$f":"H7+3","v":4},{"$f":"EDATE(I7,3)","v":"2019-04-08"},5,{"$f":"IF(EDATE(K8,2)>EDATE(K7,4),EDATE(K8,2),EDATE(K7,4))","v":"2019-05-08"},{"$f":"L8+3","v":7},{"$f":"IF(EDATE(M8,3)>EDATE(M7,6),EDATE(M8,3),EDATE(M7,6))","v":"2019-07-08"},{"$f":"N8+4","v":9},{"$f":"IF(EDATE(O8,4)>EDATE(O7,8),EDATE(O8,4),EDATE(O7,8))","v":"2019-09-08"},{"$f":"P8+5","v":11},{"$f":"IF(EDATE(Q8,5)>EDATE(Q7,10),EDATE(Q8,5),EDATE(Q7,10))","v":"2019-11-08"},{"$f":"R8+6","v":13},{"$f":"IF(EDATE(S8,6)>EDATE(S7,12),EDATE(S8,6),EDATE(S7,12))","v":"2020-01-08"},{"$f":"T8+12","v":25},{"$f":"EDATE(U8,12)","v":"2021-01-08"}]
[4,null,{"$f":"C9+7","v":"2019-01-30"},null,{"$f":"EDATE(E8,1)","v":"2019-02-23"},4,{"$f":"IF(EDATE(G9,1)>EDATE(G8,2),EDATE(G9,1),EDATE(G8,2))","v":"2019-04-08"},null,{"$f":"I9+$C$4*1.5","v":"2019-05-23"},7,{"$f":"IF(EDATE(K9,2)>EDATE(K8,4),EDATE(K9,2),EDATE(K8,4))","v":"2019-07-08"},10,{"$f":"IF(EDATE(M9,3)>EDATE(M8,6),EDATE(M9,3),EDATE(M8,6))","v":"2019-10-08"},13,{"$f":"IF(EDATE(O9,4)>EDATE(O8,8),EDATE(O9,4),EDATE(O8,8))","v":"2020-01-08"},16,{"$f":"IF(EDATE(Q9,5)>EDATE(Q8,10),EDATE(Q9,5),EDATE(Q8,10))","v":"2020-04-08"},19,{"$f":"IF(EDATE(S9,6)>EDATE(S8,12),EDATE(S9,6),EDATE(S8,12))","v":"2020-07-08"},37,"2022-01-08"]
{"$rows_left_out":189}
{"sheet":"Hoja3","index":3,"n_rows":0,"n_cols":0,"rows_kept":0,"cut":false,"hidden":true,"merged":[]}

{"sheet":"Hoja2","index":4,"n_rows":0,"n_cols":0,"rows_kept":0,"cut":false,"hidden":true,"merged":[]}

{"sheet":"Hoja1","index":5,"n_rows":0,"n_cols":0,"rows_kept":0,"cut":false,"hidden":true,"merged":[]}